{"text_format":"1","workbook":"xlsx","n_sheets":8,"sheets":["Main","Records","Names","Quran","Filter_Names","Shuffling","Elements","Results"],"not_rendered":{"charts":0,"images":1,"macros":1,"external_links":0,"defined_names":20,"comments":0,"pivot_tables":2},"unopened":[],"bounds":{"document_bytes":16777216,"sheet_cells":100000,"rows_first":2000,"rows_last":500,"rows_between":2000,"halvings":0,"cell_chars":16384,"cell_head_chars":4096},"cells_cut":0,"cells_raw":0,"read":"whole","date_system":"1900"}

{"sheet":"Main","index":0,"n_rows":5,"n_cols":10,"rows_kept":5,"cut":false,"hidden":false,"merged":[[0,1,2,7],[1,9,2,11]]}
[null,"Inter-School Quran Competition 2019"]
[null,null,null,null,null,null,null,null,null,{"$f":"Name_Selected& CHAR(10) & IF(INDIRECT(\"E6\")=\"\",\"\",\"Question \"&COUNTIF(Records!C:C,Name_Selected))","v":"-\n"}]
[]
[null,"Surah","Surah","Ayah","Mushaf","Hezb","Joz","Sajdah"]
[null,null,null,null,"بِسْمِ ٱللَّهِ ٱلرَّحْمَٰنِ ٱلرَّحِيمِ",30,604]

{"sheet":"Records","index":1,"n_rows":1,"n_cols":8,"rows_kept":1,"cut":false,"hidden":false,"merged":[]}
["Category","Part","Name","Surah","Surah Number","Ayah from","Ayah to","Time"]

{"sheet":"Names","index":2,"n_rows":91,"n_cols":5,"rows_kept":91,"cut":false,"hidden":false,"merged":[]}
["First Name","Surname","Gender","Category","Full Name"]
["Name01","Surname01","Female","Category 1",{"$f":"Table2[[#This Row],[First Name]]&\" \"&Table2[[#This Row],[Surname]]","v":"Name01 Surname01"}]
["Name02","Surname02","Female","Category 1",{"$f":"Table2[[#This Row],[First Name]]&\" \"&Table2[[#This Row],[Surname]]","v":"Name02 Surname02"}]
["Name03","Surname03","Female","Category 1",{"$f":"Table2[[#This Row],[First Name]]&\" \"&Table2[[#This Row],[Surname]]","v":"Name03 Surname03"}]
["Name04","Surname04","Female","Category 1",{"$f":"Table2[[#This Row],[First Name]]&\" \"&Table2[[#This Row],[Surname]]","v":"Name04 Surname04"}]
["Name05","Surname05","Female","Category 1",{"$f":"Table2[[#This Row],[First Name]]&\" \"&Table2[[#This Row],[Surname]]","v":"Name05 Surname05"}]
["Name06","Surname06","Female","Category 1",{"$f":"Table2[[#This Row],[First Name]]&\" \"&Table2[[#This Row],[Surname]]","v":"Name06 Surname06"}]
["Name07","Surname07","Female","Category 1",{"$f":"Table2[[#This Row],[First Name]]&\" \"&Table2[[#This Row],[Surname]]","v":"Name07 Surname07"}]
["Name08","Surname08","Female","Category 1",{"$f":"Table2[[#This Row],[First Name]]&\" \"&Table2[[#This Row],[Surname]]","v":"Name08 Surname08"}]
["Name09","Surname09","Female","Category 1",{"$f":"Table2[[#This Row],[First Name]]&\" \"&Table2[[#This Row],[Surname]]","v":"Name09 Surname09"}]
["Name10","Surname10","Male","Category 1",{"$f":"Table2[[#This Row],[First Name]]&\" \"&Table2[[#This Row],[Surname]]","v":"Name10 Surname10"}]
["Name11","Surname11","Male","Category 1",{"$f":"Table2[[#This Row],[First Name]]&\" \"&Table2[[#This Row],[Surname]]","v":"Name11 Surname11"}]
["Name12","Surname12","Male","Category 1",{"$f":"Table2[[#This Row],[First Name]]&\" \"&Table2[[#This Row],[Surname]]","v":"Name12 Surname12"}]
["Name13","Surname13","Male","Category 1",{"$f":"Table2[[#This Row],[First Name]]&\" \"&Table2[[#This Row],[Surname]]","v":"Name13 Surname13"}]
["Name14","Surname14","Male","Category 1",{"$f":"Table2[[#This Row],[First Name]]&\" \"&Table2[[#This Row],[Surname]]","v":"Name14 Surname14"}]
["Name15","Surname15","Male","Category 1",{"$f":"Table2[[#This Row],[First Name]]&\" \"&Table2[[#This Row],[Surname]]","v":"Name15 Surname15"}]
["Name16","Surname16","Male","Category 1",{"$f":"Table2[[#This Row],[First Name]]&\" \"&Table2[[#This Row],[Surname]]","v":"Name16 Surname16"}]
["Name17","Surname17","Male","Category 1",{"$f":"Table2[[#This Row],[First Name]]&\" \"&Table2[[#This Row],[Surname]]","v":"Name17 Surname17"}]
["Name18","Surname18","Male","Category 1",{"$f":"Table2[[#This Row],[First Name]]&\" \"&Table2[[#This Row],[Surname]]","v":"Name18 Surname18"}]
["Name19","Surname19","Female","Category 2",{"$f":"Table2[[#This Row],[First Name]]&\" \"&Table2[[#This Row],[Surname]]","v":"Name19 Surname19"}]
["Name20","Surname20","Female","Category 2",{"$f":"Table2[[#This Row],[First Name]]&\" \"&Table2[[#This Row],[Surname]]","v":"Name20 Surname20"}]
["Name21","Surname21","Female","Category 2",{"$f":"Table2[[#This Row],[First Name]]&\" \"&Table2[[#This Row],[Surname]]","v":"Name21 Surname21"}]
["Name22","Surname22","Female","Category 2",{"$f":"Table2[[#This Row],[First Name]]&\" \"&Table2[[#This Row],[Surname]]","v":"Name22 Surname22"}]
["Name23","Surname23","Female","Category 2",{"$f":"Table2[[#This Row],[First Name]]&\" \"&Table2[[#This Row],[Surname]]","v":"Name23 Surname23"}]
["Name24","Surname24","Female","Category 2",{"$f":"Table2[[#This Row],[First Name]]&\" \"&Table2[[#This Row],[Surname]]","v":"Name24 Surname24"}]
["Name25","Surname25","Female","Category 2",{"$f":"Table2[[#This Row],[First Name]]&\" \"&Table2[[#This Row],[Surname]]","v":"Name25 Surname25"}]
["Name26","Surname26","Female","Category 2",{"$f":"Table2[[#This Row],[First Name]]&\" \"&Table2[[#This Row],[Surname]]","v":"Name26 Surname26"}]
["Name27","Surname27","Male","Category 2",{"$f":"Table2[[#This Row],[First Name]]&\" \"&Table2[[#This Row],[Surname]]","v":"Name27 Surname27"}]
["Name28","Surname28","Male","Category 2",{"$f":"Table2[[#This Row],[First Name]]&\" \"&Table2[[#This Row],[Surname]]","v":"Name28 Surname28"}]
["Name29","Surname29","Male","Category 2",{"$f":"Table2[[#This Row],[First Name]]&\" \"&Table2[[#This Row],[Surname]]","v":"Name29 Surname29"}]
["Name30","Surname30","Male","Category 2",{"$f":"Table2[[#This Row],[First Name]]&\" \"&Table2[[#This Row],[Surname]]","v":"Name30 Surname30"}]
["Name31","Surname31","Male","Category 2",{"$f":"Table2[[#This Row],[First Name]]&\" \"&Table2[[#This Row],[Surname]]","v":"Name31 Surname31"}]
["Name32","Surname32","Male","Category 2",{"$f":"Table2[[#This Row],[First Name]]&\" \"&Table2[[#This Row],[Surname]]","v":"Name32 Surname32"}]
["Name33","Surname33","Male","Category 2",{"$f":"Table2[[#This Row],[First Name]]&\" \"&Table2[[#This Row],[Surname]]","v":"Name33 Surname33"}]
["Name34","Surname34","Male","Category 2",{"$f":"Table2[[#This Row],[First Name]]&\" \"&Table2[[#This Row],[Surname]]","v":"Name34 Surname34"}]
["Name35","Surname35","Male","Category 2",{"$f":"Table2[[#This Row],[First Name]]&\" \"&Table2[[#This Row],[Surname]]","v":"Name35 Surname35"}]
["Name36","Surname36","Male","Category 2",{"$f":"Table2[[#This Row],[First Name]]&\" \"&Table2[[#This Row],[Surname]]","v":"Name36 Surname36"}]
["Name37","Surname37","Female","Category 3",{"$f":"Table2[[#This Row],[First Name]]&\" \"&Table2[[#This Row],[Surname]]","v":"Name37 Surname37"}]
["Name38","Surname38","Female","Category 3",{"$f":"Table2[[#This Row],[First Name]]&\" \"&Table2[[#This Row],[Surname]]","v":"Name38 Surname38"}]
["Name39","Surname39","Female","Category 3",{"$f":"Table2[[#This Row],[First Name]]&\" \"&Table2[[#This Row],[Surname]]","v":"Name39 Surname39"}]
{"$rows_left_out":52}
{"sheet":"Quran","index":3,"n_rows":968,"n_cols":16,"rows_kept":968,"cut":false,"hidden":true,"merged":[]}
["Surah","Surah Number","Ayah Number","Ayah","Joz","Page","Sajdah","Index","Len","Category 1","Category 2","Category 3","Category 4","Category 5","Category 6"]
["الفاتحة",1,1,"بِسْمِ ٱللَّهِ ٱلرَّحْمَٰنِ ٱلرَّحِيمِ",1,1,null,{"$f":"B2&\"-\"&C2","v":"1-1"},{"$f":"LEN(D2)","v":38},"Part 1",null,null,null,null,null,{"$f":"TEXT(B2,\"000\")&\"-\"&A2","v":"001-الفاتحة"}]
["الفاتحة",1,2,"ٱلْحَمْدُ لِلَّهِ رَبِّ ٱلْعَٰلَمِينَ",1,1,null,"1-2",37,"Part 1",null,null,null,null,null,"001-الفاتحة"]
["الفاتحة",1,3,"ٱلرَّحْمَٰنِ ٱلرَّحِيمِ",1,1,null,"1-3",23,"Part 1",null,null,null,null,null,"001-الفاتحة"]
["الفاتحة",1,4,"مَٰلِكِ يَوْمِ ٱلدِّينِ",1,1,null,"1-4",23,"Part 1",null,null,null,null,null,"001-الفاتحة"]
["الفاتحة",1,5,"إِيَّاكَ نَعْبُدُ وَإِيَّاكَ نَسْتَعِينُ",1,1,null,"1-5",40,"Part 1",null,null,null,null,null,"001-الفاتحة"]
["الفاتحة",1,6,"ٱهْدِنَا ٱلصِّرَٰطَ ٱلْمُسْتَقِيمَ",1,1,null,"1-6",34,"Part 1",null,null,null,null,null,"001-الفاتحة"]
["الفاتحة",1,7,"صِرَٰطَ ٱلَّذِينَ أَنْعَمْتَ عَلَيْهِمْ غَيْرِ ٱلْمَغْضُوبِ عَلَيْهِمْ وَلَا ٱلضَّآلِّينَ",1,1,null,"1-7",90,"Part 1",null,null,null,null,null,"001-الفاتحة"]
["البقرة",2,255,"ٱللَّهُ لَآ إِلَٰهَ إِلَّا هُوَ ٱلْحَىُّ ٱلْقَيُّومُ ۚ لَا تَأْخُذُهُۥ سِنَةٌۭ وَلَا نَوْمٌۭ ۚ لَّهُۥ مَا فِى ٱلسَّمَٰوَٰتِ وَمَا فِى ٱلْأَرْضِ ۗ مَن ذَا ٱلَّذِى يَشْفَعُ عِندَهُۥٓ إِلَّا بِإِذْنِهِۦ ۚ يَعْلَمُ مَا بَيْنَ أَيْدِيهِمْ وَمَا خَلْفَهُمْ ۖ وَلَا يُحِيطُونَ بِشَىْءٍۢ مِّنْ عِلْمِهِۦٓ إِلَّا بِمَا شَآءَ ۚ وَسِعَ كُرْسِيُّهُ ٱلسَّمَٰوَٰتِ وَٱلْأَرْضَ ۖ وَلَا يَـُٔودُهُۥ حِفْظُهُمَا ۚ وَهُوَ ٱلْعَلِىُّ ٱلْعَظِيمُ",3,42,null,"2-255",427,"Part 2","Part 2","Part 1","Part 1",null,null,"002-البقرة"]
["الأنفال",8,0,"بِسْمِ ٱللَّهِ ٱلرَّحْمَٰنِ ٱلرَّحِيمِ",9,177,null,"8-0",38,null,null,null,null,null,"Part 2","008-الأنفال"]
["الأنفال",8,1,"يَسْـَٔلُونَكَ عَنِ ٱلْأَنفَالِ ۖ قُلِ ٱلْأَنفَالُ لِلَّهِ وَٱلرَّسُولِ ۖ فَٱتَّقُوا۟ ٱللَّهَ وَأَصْلِحُوا۟ ذَاتَ بَيْنِكُمْ ۖ وَأَطِيعُوا۟ ٱللَّهَ وَرَسُولَهُۥٓ إِن كُنتُم مُّؤْمِنِينَ",9,177,null,"8-1",185,null,null,null,null,null,"Part 2","008-الأنفال"]
["الأنفال",8,2,"إِنَّمَا ٱلْمُؤْمِنُونَ ٱلَّذِينَ إِذَا ذُكِرَ ٱللَّهُ وَجِلَتْ قُلُوبُهُمْ وَإِذَا تُلِيَتْ عَلَيْهِمْ ءَايَٰتُهُۥ زَادَتْهُمْ إِيمَٰنًۭا وَعَلَىٰ رَبِّهِمْ يَتَوَكَّلُونَ",9,177,null,"8-2",172,null,null,null,null,null,"Part 2","008-الأنفال"]
["الأنفال",8,3,"ٱلَّذِينَ يُقِيمُونَ ٱلصَّلَوٰةَ وَمِمَّا رَزَقْنَٰهُمْ يُنفِقُونَ",9,177,null,"8-3",66,null,null,null,null,null,"Part 2","008-الأنفال"]
["الأنفال",8,4,"أُو۟لَٰٓئِكَ هُمُ ٱلْمُؤْمِنُونَ حَقًّۭا ۚ لَّهُمْ دَرَجَٰتٌ عِندَ رَبِّهِمْ وَمَغْفِرَةٌۭ وَرِزْقٌۭ كَرِيمٌۭ",9,177,null,"8-4",109,null,null,null,null,null,"Part 2","008-الأنفال"]
["الأنفال",8,5,"كَمَآ أَخْرَجَكَ رَبُّكَ مِنۢ بَيْتِكَ بِٱلْحَقِّ وَإِنَّ فَرِيقًۭا مِّنَ ٱلْمُؤْمِنِينَ لَكَٰرِهُونَ",9,177,null,"8-5",102,null,null,null,null,null,"Part 2","008-الأنفال"]
["الأنفال",8,6,"يُجَٰدِلُونَكَ فِى ٱلْحَقِّ بَعْدَمَا تَبَيَّنَ كَأَنَّمَا يُسَاقُونَ إِلَى ٱلْمَوْتِ وَهُمْ يَنظُرُونَ",9,177,null,"8-6",103,null,null,null,null,null,"Part 2","008-الأنفال"]
["الأنفال",8,7,"وَإِذْ يَعِدُكُمُ ٱللَّهُ إِحْدَى ٱلطَّآئِفَتَيْنِ أَنَّهَا لَكُمْ وَتَوَدُّونَ أَنَّ غَيْرَ ذَاتِ ٱلشَّوْكَةِ تَكُونُ لَكُمْ وَيُرِيدُ ٱللَّهُ أَن يُحِقَّ ٱلْحَقَّ بِكَلِمَٰتِهِۦ وَيَقْطَعَ دَابِرَ ٱلْكَٰفِرِينَ",9,177,null,"8-7",213,null,null,null,null,null,"Part 2","008-الأنفال"]
["الأنفال",8,8,"لِيُحِقَّ ٱلْحَقَّ وَيُبْطِلَ ٱلْبَٰطِلَ وَلَوْ كَرِهَ ٱلْمُجْرِمُونَ",9,177,null,"8-8",69,null,null,null,null,null,"Part 2","008-الأنفال"]
["الأنفال",8,9,"إِذْ تَسْتَغِيثُونَ رَبَّكُمْ فَٱسْتَجَابَ لَكُمْ أَنِّى مُمِدُّكُم بِأَلْفٍۢ مِّنَ ٱلْمَلَٰٓئِكَةِ مُرْدِفِينَ",9,178,null,"8-9",111,null,null,null,null,null,"Part 2","008-الأنفال"]
["الأنفال",8,10,"وَمَا جَعَلَهُ ٱللَّهُ إِلَّا بُشْرَىٰ وَلِتَطْمَئِنَّ بِهِۦ قُلُوبُكُمْ ۚ وَمَا ٱلنَّصْرُ إِلَّا مِنْ عِندِ ٱللَّهِ ۚ إِنَّ ٱللَّهَ عَزِيزٌ حَكِيمٌ",9,178,null,"8-10",148,null,null,null,null,null,"Part 2","008-الأنفال"]
["الأنفال",8,11,"إِذْ يُغَشِّيكُمُ ٱلنُّعَاسَ أَمَنَةًۭ مِّنْهُ وَيُنَزِّلُ عَلَيْكُم مِّنَ ٱلسَّمَآءِ مَآءًۭ لِّيُطَهِّرَكُم بِهِۦ وَيُذْهِبَ عَنكُمْ رِجْزَ ٱلشَّيْطَٰنِ وَلِيَرْبِطَ عَلَىٰ قُلُوبِكُمْ وَيُثَبِّتَ بِهِ ٱلْأَقْدَامَ",9,178,null,"8-11",217,null,null,null,null,null,"Part 2","008-الأنفال"]
["الأنفال",8,12,"إِذْ يُوحِى رَبُّكَ إِلَى ٱلْمَلَٰٓئِكَةِ أَنِّى مَعَكُمْ فَثَبِّتُوا۟ ٱلَّذِينَ ءَامَنُوا۟ ۚ سَأُلْقِى فِى قُلُوبِ ٱلَّذِينَ كَفَرُوا۟ ٱلرُّعْبَ فَٱضْرِبُوا۟ فَوْقَ ٱلْأَعْنَاقِ وَٱضْرِبُوا۟ مِنْهُمْ كُلَّ بَنَانٍۢ",9,178,null,"8-12",215,null,null,null,null,null,"Part 2","008-الأنفال"]
["الأنفال",8,13,"ذَٰلِكَ بِأَنَّهُمْ شَآقُّوا۟ ٱللَّهَ وَرَسُولَهُۥ ۚ وَمَن يُشَاقِقِ ٱللَّهَ وَرَسُولَهُۥ فَإِنَّ ٱللَّهَ شَدِيدُ ٱلْعِقَابِ",9,178,null,"8-13",125,null,null,null,null,null,"Part 2","008-الأنفال"]
["الأنفال",8,14,"ذَٰلِكُمْ فَذُوقُوهُ وَأَنَّ لِلْكَٰفِرِينَ عَذَابَ ٱلنَّارِ",9,178,null,"8-14",60,null,null,null,null,null,"Part 2","008-الأنفال"]
["الأنفال",8,15,"يَٰٓأَيُّهَا ٱلَّذِينَ ءَامَنُوٓا۟ إِذَا لَقِيتُمُ ٱلَّذِينَ كَفَرُوا۟ زَحْفًۭا فَلَا تُوَلُّوهُمُ ٱلْأَدْبَارَ",9,178,null,"8-15",111,null,null,null,null,null,"Part 2","008-الأنفال"]
["الأنفال",8,16,"وَمَن يُوَلِّهِمْ يَوْمَئِذٍۢ دُبُرَهُۥٓ إِلَّا مُتَحَرِّفًۭا لِّقِتَالٍ أَوْ مُتَحَيِّزًا إِلَىٰ فِئَةٍۢ فَقَدْ بَآءَ بِغَضَبٍۢ مِّنَ ٱللَّهِ وَمَأْوَىٰهُ جَهَنَّمُ ۖ وَبِئْسَ ٱلْمَصِيرُ",9,178,null,"8-16",188,null,null,null,null,null,"Part 2","008-الأنفال"]
["الأنفال",8,17,"فَلَمْ تَقْتُلُوهُمْ وَلَٰكِنَّ ٱللَّهَ قَتَلَهُمْ ۚ وَمَا رَمَيْتَ إِذْ رَمَيْتَ وَلَٰكِنَّ ٱللَّهَ رَمَىٰ ۚ وَلِيُبْلِىَ ٱلْمُؤْمِنِينَ مِنْهُ بَلَآءً حَسَنًا ۚ إِنَّ ٱللَّهَ سَمِيعٌ عَلِيمٌۭ",9,179,null,"8-17",194,null,null,null,null,null,"Part 2","008-الأنفال"]
["الأنفال",8,18,"ذَٰلِكُمْ وَأَنَّ ٱللَّهَ مُوهِنُ كَيْدِ ٱلْكَٰفِرِينَ",9,179,null,"8-18",54,null,null,null,null,null,"Part 2","008-الأنفال"]
["الأنفال",8,19,"إِن تَسْتَفْتِحُوا۟ فَقَدْ جَآءَكُمُ ٱلْفَتْحُ ۖ وَإِن تَنتَهُوا۟ فَهُوَ خَيْرٌۭ لَّكُمْ ۖ وَإِن تَعُودُوا۟ نَعُدْ وَلَن تُغْنِىَ عَنكُمْ فِئَتُكُمْ شَيْـًۭٔا وَلَوْ كَثُرَتْ وَأَنَّ ٱللَّهَ مَعَ ٱلْمُؤْمِنِينَ",9,179,null,"8-19",211,null,null,null,null,null,"Part 2","008-الأنفال"]
["الأنفال",8,20,"يَٰٓأَيُّهَا ٱلَّذِينَ ءَامَنُوٓا۟ أَطِيعُوا۟ ٱللَّهَ وَرَسُولَهُۥ وَلَا تَوَلَّوْا۟ عَنْهُ وَأَنتُمْ تَسْمَعُونَ",9,179,null,"8-20",113,null,null,null,null,null,"Part 2","008-الأنفال"]
["الأنفال",8,21,"وَلَا تَكُونُوا۟ كَٱلَّذِينَ قَالُوا۟ سَمِعْنَا وَهُمْ لَا يَسْمَعُونَ",9,179,null,"8-21",70,null,null,null,null,null,"Part 2","008-الأنفال"]
["الأنفال",8,22,"۞ إِنَّ شَرَّ ٱلدَّوَآبِّ عِندَ ٱللَّهِ ٱلصُّمُّ ٱلْبُكْمُ ٱلَّذِينَ لَا يَعْقِلُونَ",9,179,null,"8-22",85,null,null,null,null,null,"Part 2","008-الأنفال"]
["الأنفال",8,23,"وَلَوْ عَلِمَ ٱللَّهُ فِيهِمْ خَيْرًۭا لَّأَسْمَعَهُمْ ۖ وَلَوْ أَسْمَعَهُمْ لَتَوَلَّوا۟ وَّهُم مُّعْرِضُونَ",9,179,null,"8-23",109,null,null,null,null,null,"Part 2","008-الأنفال"]
["الأنفال",8,24,"يَٰٓأَيُّهَا ٱلَّذِينَ ءَامَنُوا۟ ٱسْتَجِيبُوا۟ لِلَّهِ وَلِلرَّسُولِ إِذَا دَعَاكُمْ لِمَا يُحْيِيكُمْ ۖ وَٱعْلَمُوٓا۟ أَنَّ ٱللَّهَ يَحُولُ بَيْنَ ٱلْمَرْءِ وَقَلْبِهِۦ وَأَنَّهُۥٓ إِلَيْهِ تُحْشَرُونَ",9,179,null,"8-24",203,null,null,null,null,null,"Part 2","008-الأنفال"]
["الأنفال",8,25,"وَٱتَّقُوا۟ فِتْنَةًۭ لَّا تُصِيبَنَّ ٱلَّذِينَ ظَلَمُوا۟ مِنكُمْ خَآصَّةًۭ ۖ وَٱعْلَمُوٓا۟ أَنَّ ٱللَّهَ شَدِيدُ ٱلْعِقَابِ",9,179,null,"8-25",125,null,null,null,null,null,"Part 2","008-الأنفال"]
["الأنفال",8,26,"وَٱذْكُرُوٓا۟ إِذْ أَنتُمْ قَلِيلٌۭ مُّسْتَضْعَفُونَ فِى ٱلْأَرْضِ تَخَافُونَ أَن يَتَخَطَّفَكُمُ ٱلنَّاسُ فَـَٔاوَىٰكُمْ وَأَيَّدَكُم بِنَصْرِهِۦ وَرَزَقَكُم مِّنَ ٱلطَّيِّبَٰتِ لَعَلَّكُمْ تَشْكُرُونَ",9,180,null,"8-26",202,null,null,null,null,null,"Part 2","008-الأنفال"]
["الأنفال",8,27,"يَٰٓأَيُّهَا ٱلَّذِينَ ءَامَنُوا۟ لَا تَخُونُوا۟ ٱللَّهَ وَٱلرَّسُولَ وَتَخُونُوٓا۟ أَمَٰنَٰتِكُمْ وَأَنتُمْ تَعْلَمُونَ",9,180,null,"8-27",120,null,null,null,null,null,"Part 2","008-الأنفال"]
["الأنفال",8,28,"وَٱعْلَمُوٓا۟ أَنَّمَآ أَمْوَٰلُكُمْ وَأَوْلَٰدُكُمْ فِتْنَةٌۭ وَأَنَّ ٱللَّهَ عِندَهُۥٓ أَجْرٌ عَظِيمٌۭ",9,180,null,"8-28",105,null,null,null,null,null,"Part 2","008-الأنفال"]
["الأنفال",8,29,"يَٰٓأَيُّهَا ٱلَّذِينَ ءَامَنُوٓا۟ إِن تَتَّقُوا۟ ٱللَّهَ يَجْعَل لَّكُمْ فُرْقَانًۭا وَيُكَفِّرْ عَنكُمْ سَيِّـَٔاتِكُمْ وَيَغْفِرْ لَكُمْ ۗ وَٱللَّهُ ذُو ٱلْفَضْلِ ٱلْعَظِيمِ",9,180,null,"8-29",176,null,null,null,null,null,"Part 2","008-الأنفال"]
["الأنفال",8,30,"وَإِذْ يَمْكُرُ بِكَ ٱلَّذِينَ كَفَرُوا۟ لِيُثْبِتُوكَ أَوْ يَقْتُلُوكَ أَوْ يُخْرِجُوكَ ۚ وَيَمْكُرُونَ وَيَمْكُرُ ٱللَّهُ ۖ وَٱللَّهُ خَيْرُ ٱلْمَٰكِرِينَ",9,180,null,"8-30",156,null,null,null,null,null,"Part 2","008-الأنفال"]
{"$rows_left_out":929}
{"sheet":"Filter_Names","index":4,"n_rows":13,"n_cols":2,"rows_kept":13,"cut":false,"hidden":true,"merged":[]}
["Category","Category 1"]
["Gender","Female"]
[]
["-"]
["Name01 Surname01"]
["Name02 Surname02"]
["Name03 Surname03"]
["Name04 Surname04"]
["Name05 Surname05"]
["Name06 Surname06"]
["Name07 Surname07"]
["Name08 Surname08"]
["Name09 Surname09"]

{"sheet":"Shuffling","index":5,"n_rows":74,"n_cols":9,"rows_kept":74,"cut":false,"hidden":true,"merged":[]}
["Category 1","Part 1",null,null,null,"Random",{"$f":"RAND()*SUM(C:C)","v":2078.1081775897333},"Surah",{"$f":"INDEX(A:A,G2)","v":112}]
[null,null,null,null,null,"Match",{"$f":"MATCH(G1,D:D)","v":57},"Ayah",{"$f":"INDEX(B:B,G2)","v":0}]
["Surah Number","Ayah Number","Sum of Len",null,null,null,null,"Match Index",{"$f":"MATCH(Selected_Surah&\"-\"&Selected_Ayah,Quran!H:H,0)","v":951}]
[1,1,38,0]
[1,2,37,{"$f":"D4+C4","v":38}]
[1,3,23,75]
[1,4,23,98]
[1,5,40,121]
[1,6,34,161]
[1,7,90,195]
[94,0,38,285]
[94,1,29,323]
[94,2,26,352]
[94,3,25,378]
[94,4,25,403]
[94,5,30,428]
[94,6,29,458]
[94,7,25,487]
[94,8,25,512]
[97,0,38,537]
[97,1,44,575]
[97,2,40,619]
[97,3,47,659]
[97,4,80,706]
[97,5,39,786]
[103,0,38,825]
[103,1,11,863]
[103,2,30,874]
[103,3,104,904]
[105,0,38,1008]
[105,1,54,1046]
[105,2,41,1100]
[105,3,40,1141]
[105,4,38,1181]
[105,5,34,1219]
[108,0,38,1253]
[108,1,33,{"$f":"D36+C36","v":1291}]
[108,2,27,1324]
[108,3,32,1351]
[109,0,38,1383]
{"$rows_left_out":35}
{"sheet":"Elements","index":6,"n_rows":11,"n_cols":11,"rows_kept":11,"cut":false,"hidden":true,"merged":[]}
["Categories","Gender","Parts",null,"Item","Value","Result","Previous",null,"Categories","Max_len"]
["Category 1","Both Genders","All",null,"Category",1,{"$f":"INDEX(A2:A7,F2)","v":"Category 1"},"Category 1",null,"Category 1",250]
["Category 2","Male","Part 1",null,"Gender",3,{"$f":"INDEX(B2:B4,F3)","v":"Female"},"Female",null,"Category 2",290]
["Category 3","Female","Part 2",null,"Parts",2,{"$f":"INDEX(C2:C5,F4)","v":"Part 1"},"Part 1",null,"Category 3",330]
["Category 4",null,"Part 3",null,"Student",1,{"$f":"INDEX(Filter_Names!A4:A13,Name_Value)","v":"-"},"Participant 3 ",null,"Category 4",370]
["Category 5",null,null,null,"Max_len",{"$f":"MATCH(Category_Selected,J2:J7,0)","v":1},{"$f":"INDEX(K2:K7,F6)","v":250},"-",null,"Category 5",410]
["Category 6",null,null,null,"Changed?","-","-",{"$f":"NOT(AND(Category_Selected=Category_Previous,Gender_Selected=Gender_Previous,Part_Selected=Part_Previous,Name_Selected=Name_Previous))","v":true},null,"Category 6",450]
[null,null,null,null,"Ayah from","-",{"$f":"MIN(Main!D:D)","v":0},"-"]
[null,null,null,null,"Ayah to","-",{"$f":"MAX(Main!D:D)","v":0},"-"]
[null,null,null,null,"Surah","-",{"$f":"INDIRECT(\"Main!B5\")","v":0},"-"]
[null,null,null,null,"Surah Number",null,{"$f":"INDIRECT(\"Main!C5\")","v":0}]

{"sheet":"Results","index":7,"n_rows":6,"n_cols":1,"rows_kept":6,"cut":false,"hidden":true,"merged":[]}
["Previous values"]
[951]
[952]
[953]
[954]
[955]